Leave a Reply

27 Comments on "React JS / Redux Tutorial – 3 – Project Setup"

Notify of
avatar

Lucas Haladjian
Guest
Lucas Haladjian
3 months 4 days ago

I keep getting that error when I do webpack in my terminal: ERROR in ./dev/js/index.jsModule build failed: SyntaxError: Unexpected token (6:4) 4 | 5 | ReactDOM.render(> 6 | <Provider store={store}> | ^ 7 | <App /> 8 | </Provider>, 9 | document.getElementById('root')

aayush bhardwaj
Guest
aayush bhardwaj
7 days 10 hours ago

Had the same error initially , your .babelrc file must be missing in the folder.

Ricky Merrefield
Guest
Ricky Merrefield
3 months 2 days ago

I'm getting the same error. Can't figure out why.

Kevin Waddle
Guest
Kevin Waddle
3 months 22 days ago

I get this error when I try to run webpack:$ webpackmodule.js:327 throw err; ^Error: Cannot find module 'webpack' at Function.Module._resolveFilename (module.js:325:15) at Function.Module._load (module.js:276:25) at Module.require (module.js:353:17) at require (internal/module.js:12:17) at Object.<anonymous> (C:UsersbonzoDesktopReact-Redux-Boilerplate-masterwebpack.config.js:2:15) at Module._compile (module.js:409:26) at Object.Module._extensions..js (module.js:416:10) at Module.load (module.js:343:32) at Function.Module._load (module.js:300:12) at Module.require (module.js:353:17)Pls help : (

Dave Albert
Guest
Dave Albert
3 months 29 days ago

I can't seem to get past: "Uncaught SyntaxError: Unexpected token import"

Dave Albert
Guest
Dave Albert
3 months 29 days ago

It's because I can't spell. fix === mv .bablerc .babelrc

aa aa
Guest
aa aa
4 months 14 days ago

I'm using win7 x64., npm install , fsevents failed , the page cant autofresh, anyone know how to fix? thanks.

aa aa
Guest
aa aa
4 months 14 days ago

I found the solultion. For those who use Intellij(webstorm, IDEA etc) , turn off the "safe write"(you can search for that)

Alexis Pavlidis
Guest
Alexis Pavlidis
4 months 27 days ago

In case you getting: "'webpack' is not recognized as an internal or external command, operable program or batch file.,try add to the path variable 'c:UsersMeAppDataRoamingnpm' (instead of 'Me' write your username)This solved my problem.

Robert Kelly
Guest
Robert Kelly
5 months 13 days ago

you say json funny, good tutorial tho!

Luke Kim
Guest
Luke Kim
5 months 18 days ago

Very frustrated with this, npm run start does not work …. pm ERR! code ELIFECYCLEnpm ERR! react-redux-template@1.0.0 start: `webpack-dev-server`npm ERR! Exit status 1npm ERR!npm ERR! Failed at the react-redux-template@1.0.0 start script 'webpack-dev-server'.

Tam Dc
Guest
Tam Dc
2 months 28 days ago

same.

Mr100pic
Guest
Mr100pic
5 months 18 days ago

Can't wait for the webpack tutorials.

PrimeCycles
Guest
PrimeCycles
5 months 23 days ago

I downloaded it and got it all setup but when I changed the names, saved, and reloaded the page, nothing changed.

yamahauler125
Guest
yamahauler125
6 months 1 day ago

When I try to run webpack, I get an error:+1 hidden modulesERROR in Cannot find module 'core-js/library/fn/symbol/iterator'Any ideas?

Felipe Tadeo Jr.
Guest
Felipe Tadeo Jr.
10 days 23 hours ago
yamahauler125
Guest
yamahauler125
5 months 26 days ago

Fixed my own issue… I had an outdated version of node.js. Updated node and deleted the node_modules directory. Then did npm install and worked like a charm 😉

wpDiscuz